Target
Prothrombin
Ligand
BDBM50404539
Substrate
Meas. Tech.
ChEMBL_210578 (CHEMBL816529)
IC50
6500000000±n/a nM
Citation
 Kikumoto, RTamao, YOhkubo, KTezuka, TTonomura, SOkamoto, SFunahara, YHijikata, A Thrombin inhibitors. 2. Amide derivatives of N alpha-substituted L-arginine. J Med Chem 23:830-6 (1980)  
Target
Name:
Prothrombin
Synonyms:
Activation peptide fragment 1 Coagulation factor II Prothrombin Thrombin Thrombin light chain
Type:
Enzyme
Mol. Mass.:
70502.73
Organism:
Bos taurus (Bovine)
Description:
P00735
Residue:
625
  
Inhibitor
Name:
BDBM50404539
Synonyms:
CHEMBL350285
Type:
Small organic molecule
Emp. Form.:
C24H36N6O3S
Mol. Mass.:
488.646
SMILES:
CC1CCCN(C1)C(=O)C(CCCNC(N)=N)NS(=O)(=O)c1cccc2c(cccc12)N(C)C
: