Target
Beta-2 adrenergic receptor
Ligand
BDBM50404696
Substrate
Meas. Tech.
ChEMBL_37850 (CHEMBL876540)
Kd
81.28±n/a nM
Citation
 Lalloz, LLoppinet, VCoudert, GGuillaumet, GLoubinoux, BLabrid, CBeaughard, MDureng, GLamar, JC 2-Benzodioxinylaminoethanols: a new class of beta-adrenergic blocking and antihypertensive agents. J Med Chem 24:994-8 (1982)  
Target
Name:
Beta-2 adrenergic receptor
Synonyms:
ADRB2_CAVPO adrenergic Beta2
Type:
Enzyme Catalytic Domain
Mol. Mass.:
46993.24
Organism:
GUINEA PIG
Description:
adrenergic Beta2 ADRB2 GUINEA PIG::Q8K4Z4
Residue:
418
  
Inhibitor
Name:
BDBM50404696
Synonyms:
CHEMBL427310
Type:
Small organic molecule
Emp. Form.:
C14H19NO3
Mol. Mass.:
249.3056
SMILES:
CC(C)(C)NCC(O)C1=COc2ccccc2O1
: