Target
Beta-2 adrenergic receptor
Ligand
BDBM50405146
Substrate
Meas. Tech.
ChEMBL_38614 (CHEMBL652296)
Kd
29.51±n/a nM
Citation
 Nelson, WLBartels, MJBednarski, PJZhang, SMessick, KHorng, JSRuffolo, RR The 3,4-catechol derivative of propranolol, a minor dihydroxylated metabolite. J Med Chem 27:857-61 (1984)  
Target
Name:
Beta-2 adrenergic receptor
Synonyms:
ADRB2 | ADRB2_CANLF
Type:
PROTEIN
Mol. Mass.:
46593.67
Organism:
Canis familiaris
Description:
ChEMBL_56504
Residue:
415
  
Inhibitor
Name:
BDBM50405146
Synonyms:
CHEMBL171432
Type:
Small organic molecule
Emp. Form.:
C16H19NO4
Mol. Mass.:
289.3264
SMILES:
CC(C)NCC(O)COC1=CC(=O)C(=O)c2ccccc12
: