Target
Cholecystokinin receptor type A
Ligand
BDBM50019241
Substrate
Meas. Tech.
ChEMBL_50035 (CHEMBL666755)
IC50
70.79±n/a nM
Citation
 Tokarski, JSHopfinger, AJ Three-dimensional molecular shape analysis-quantitative structure-activity relationship of a series of cholecystokinin-A receptor antagonists. J Med Chem 37:3639-54 (1994)  
Target
Name:
Cholecystokinin receptor type A
Synonyms:
CCKAR_RAT Cholecystokinin peripheral Cholecystokinin receptor type A
Type:
Enzyme Catalytic Domain
Mol. Mass.:
49676.37
Organism:
RAT
Description:
Cholecystokinin central 0 RAT::P30551
Residue:
444
  
Inhibitor
Name:
BDBM50019241
Synonyms:
5-Hydroxy-1H-indole-2-carboxylic acid [5-(2-fluoro-phenyl)-2-oxo-2,3-dihydro-1H-benzo[e][1,4]diazepin-3-yl]-amide CHEMBL74066
Type:
Small organic molecule
Emp. Form.:
C24H17FN4O3
Mol. Mass.:
428.4152
SMILES:
Oc1ccc2[nH]c(cc2c1)C(=O)NC1N=C(c2ccccc2F)c2ccccc2NC1=O
: