Target
D(2) dopamine receptor
Ligand
BDBM50040237
Substrate
Meas. Tech.
ChEMBL_58226 (CHEMBL669953)
Ki
4.5±n/a nM
Citation
 Liégeois, JFRogister, FABruhwyler, JDamas, JNguyen, TPInarejos, MOChleide, EMMercier, MGDelarge, JE Pyridobenzoxazepine and pyridobenzothiazepine derivatives as potential central nervous system agents: synthesis and neurochemical study. J Med Chem 37:519-25 (1994)  
Target
Name:
D(2) dopamine receptor
Synonyms:
DOPAMINE D2 DOPAMINE D2 Short Dopamine D2 receptor Drd2
Type:
G Protein-Coupled Receptor (GPCR)
Mol. Mass.:
50931.60
Organism:
Rattus norvegicus (rat)
Description:
P61169
Residue:
444
  
Inhibitor
Name:
BDBM50040237
Synonyms:
2-Chloro-11-(4-methyl-piperazin-1-yl)-dibenzo[b,f][1,4]thiazepine 2-chloro-11-(4-methylpiperazin-1-yl)dibenzo[b,f][1,4]thiazepine Clothiapine
Type:
Small organic molecule
Emp. Form.:
C18H18ClN3S
Mol. Mass.:
343.874
SMILES:
CN1CCN(CC1)C1=Nc2ccccc2Sc2ccc(Cl)cc12
: