Target
5-hydroxytryptamine receptor 1D
Ligand
BDBM50407768
Substrate
Meas. Tech.
ChEMBL_1953 (CHEMBL617560)
IC50
57543.99±n/a nM
Citation
 Rault, SLancelot, JCPrunier, HRobba, MRenard, PDelagrange, PPfeiffer, BCaignard, DHGuardiola-Lemaitre, BHamon, M Novel selective and partial agonists of 5-HT3 receptors. Part 1. Synthesis and biological evaluation of piperazinopyrrolothienopyrazines. J Med Chem 39:2068-80 (1996)  
Target
Name:
5-hydroxytryptamine receptor 1D
Synonyms:
5HT1D_PIG Serotonin 1d (5-HT1d) receptor
Type:
PROTEIN
Mol. Mass.:
32680.56
Organism:
Sus scrofa
Description:
ChEMBL_1963
Residue:
291
  
Inhibitor
Name:
BDBM50407768
Synonyms:
CHEMBL63845
Type:
Small organic molecule
Emp. Form.:
C20H17F3N4S
Mol. Mass.:
402.436
SMILES:
FC(F)(F)c1cccc(c1)N1CCN(CC1)c1nc2sccc2n2cccc12
: