Target
5-hydroxytryptamine receptor 1A
Ligand
BDBM50407768
Substrate
Meas. Tech.
ChEMBL_560 (CHEMBL615580)
IC50
12589.25±n/a nM
Citation
 Rault, SLancelot, JCPrunier, HRobba, MRenard, PDelagrange, PPfeiffer, BCaignard, DHGuardiola-Lemaitre, BHamon, M Novel selective and partial agonists of 5-HT3 receptors. Part 1. Synthesis and biological evaluation of piperazinopyrrolothienopyrazines. J Med Chem 39:2068-80 (1996)  
Target
Name:
5-hydroxytryptamine receptor 1A
Synonyms:
5-HT-1A 5-hydroxytryptamine receptor 1A (5-HT-1A) ADRB2RL1 Dopamine D2 receptor and serotonin 1a receptor HTR1A | Serotonin receptor 1A
Type:
Mol. Mass.:
46122.49
Organism:
Homo sapiens (Human)
Description:
Residue:
422
  
Inhibitor
Name:
BDBM50407768
Synonyms:
CHEMBL63845
Type:
Small organic molecule
Emp. Form.:
C20H17F3N4S
Mol. Mass.:
402.436
SMILES:
FC(F)(F)c1cccc(c1)N1CCN(CC1)c1nc2sccc2n2cccc12
: