Target
5-hydroxytryptamine receptor 2C
Ligand
BDBM50407768
Substrate
Meas. Tech.
ChEMBL_2786 (CHEMBL617855)
IC50
5888.44±n/a nM
Citation
 Rault, SLancelot, JCPrunier, HRobba, MRenard, PDelagrange, PPfeiffer, BCaignard, DHGuardiola-Lemaitre, BHamon, M Novel selective and partial agonists of 5-HT3 receptors. Part 1. Synthesis and biological evaluation of piperazinopyrrolothienopyrazines. J Med Chem 39:2068-80 (1996)  
Target
Name:
5-hydroxytryptamine receptor 2C
Synonyms:
5-HT-1C 5-HT1C 5-HT2C-INI 5-HTR2C 5-hydroxytryptamine receptor 2C (5-HT-2C) 5HT-1C HTR1C Serotonin (5-HT3) receptor Serotonin Receptor 2C
Type:
G Protein-Coupled Receptor (GPCR)
Mol. Mass.:
51836.79
Organism:
Homo sapiens (Human)
Description:
P28335
Residue:
458
  
Inhibitor
Name:
BDBM50407768
Synonyms:
CHEMBL63845
Type:
Small organic molecule
Emp. Form.:
C20H17F3N4S
Mol. Mass.:
402.436
SMILES:
FC(F)(F)c1cccc(c1)N1CCN(CC1)c1nc2sccc2n2cccc12
: