Target
5-hydroxytryptamine receptor 2A
Ligand
BDBM50407760
Substrate
Meas. Tech.
ChEMBL_2255 (CHEMBL873476)
IC50
1778.28±n/a nM
Citation
 Rault, SLancelot, JCPrunier, HRobba, MRenard, PDelagrange, PPfeiffer, BCaignard, DHGuardiola-Lemaitre, BHamon, M Novel selective and partial agonists of 5-HT3 receptors. Part 1. Synthesis and biological evaluation of piperazinopyrrolothienopyrazines. J Med Chem 39:2068-80 (1996)  
Target
Name:
5-hydroxytryptamine receptor 2A
Synonyms:
5-HT2A 5HTR2A Serotonin 2a (5-HT2a) receptor
Type:
Enzyme Catalytic Domain
Mol. Mass.:
52578.24
Organism:
BOVINE
Description:
5-HT2A HTR2A BOVINE::Q75Z89
Residue:
470
  
Inhibitor
Name:
BDBM50407760
Synonyms:
CHEMBL68390
Type:
Small organic molecule
Emp. Form.:
C20H17F3N4S
Mol. Mass.:
402.436
SMILES:
FC(F)(F)c1cccc(c1)N1CCN(CC1)c1nc2ccsc2n2cccc12
: