Target
Translocator protein
Ligand
BDBM50408008
Substrate
Meas. Tech.
ChEMBL_38119 (CHEMBL650074)
IC50
243000000±n/a nM
Citation
 So, SSKarplus, M Genetic neural networks for quantitative structure-activity relationships: improvements and application of benzodiazepine affinity for benzodiazepine/GABAA receptors. J Med Chem 39:5246-56 (1997)  
Target
Name:
Translocator protein
Synonyms:
BZRP Mitochondrial benzodiazepine receptor PKBS Peripheral-type benzodiazepine receptor TSPO_HUMAN
Type:
Enzyme
Mol. Mass.:
18834.74
Organism:
Homo sapiens (Human)
Description:
P30536
Residue:
169
  
Inhibitor
Name:
BDBM50408008
Synonyms:
CHEMBL346673 | Ro-07-4065
Type:
Small organic molecule
Emp. Form.:
C16H11ClF2N2O
Mol. Mass.:
320.721
SMILES:
CN1c2ccc(Cl)cc2C(=NCC1=O)c1c(F)cccc1F
: