Target
Translocator protein
Ligand
BDBM50408018
Substrate
Meas. Tech.
ChEMBL_38119 (CHEMBL650074)
IC50
10800000±n/a nM
Citation
 So, SSKarplus, M Genetic neural networks for quantitative structure-activity relationships: improvements and application of benzodiazepine affinity for benzodiazepine/GABAA receptors. J Med Chem 39:5246-56 (1997)  
Target
Name:
Translocator protein
Synonyms:
BZRP Mitochondrial benzodiazepine receptor PKBS Peripheral-type benzodiazepine receptor TSPO_HUMAN
Type:
Enzyme
Mol. Mass.:
18834.74
Organism:
Homo sapiens (Human)
Description:
P30536
Residue:
169
  
Inhibitor
Name:
BDBM50408018
Synonyms:
HALAZEPAM
Type:
Small organic molecule
Emp. Form.:
C17H12ClF3N2O
Mol. Mass.:
352.738
SMILES:
FC(F)(F)CN1c2ccc(Cl)cc2C(=NCC1=O)c1ccccc1
: