Target
Translocator protein
Ligand
BDBM50026859
Substrate
Meas. Tech.
ChEMBL_38119 (CHEMBL650074)
IC50
181000000±n/a nM
Citation
 So, SSKarplus, M Genetic neural networks for quantitative structure-activity relationships: improvements and application of benzodiazepine affinity for benzodiazepine/GABAA receptors. J Med Chem 39:5246-56 (1997)  
Target
Name:
Translocator protein
Synonyms:
BZRP Mitochondrial benzodiazepine receptor PKBS Peripheral-type benzodiazepine receptor TSPO_HUMAN
Type:
Enzyme
Mol. Mass.:
18834.74
Organism:
Homo sapiens (Human)
Description:
P30536
Residue:
169
  
Inhibitor
Name:
BDBM50026859
Synonyms:
7-Chloro-5-(2,6-dichloro-phenyl)-1-methyl-1,3-dihydro-benzo[e][1,4]diazepin-2-one Ro-07-5220
Type:
Small organic molecule
Emp. Form.:
C16H11Cl3N2O
Mol. Mass.:
353.63
SMILES:
CN1c2ccc(Cl)cc2C(=NCC1=O)c1c(Cl)cccc1Cl
: