Target
Translocator protein
Ligand
BDBM50408024
Substrate
Meas. Tech.
ChEMBL_38119 (CHEMBL650074)
IC50
76900000±n/a nM
Citation
 So, SSKarplus, M Genetic neural networks for quantitative structure-activity relationships: improvements and application of benzodiazepine affinity for benzodiazepine/GABAA receptors. J Med Chem 39:5246-56 (1997)  
Target
Name:
Translocator protein
Synonyms:
BZRP Mitochondrial benzodiazepine receptor PKBS Peripheral-type benzodiazepine receptor TSPO_HUMAN
Type:
Enzyme
Mol. Mass.:
18834.74
Organism:
Homo sapiens (Human)
Description:
P30536
Residue:
169
  
Inhibitor
Name:
BDBM50408024
Synonyms:
RO-052904 | Ro-05-2904
Type:
Small organic molecule
Emp. Form.:
C16H11F3N2O
Mol. Mass.:
304.2665
SMILES:
FC(F)(F)c1ccc2NC(=O)CN=C(c3ccccc3)c2c1
: