Target
Translocator protein
Ligand
BDBM50060095
Substrate
Meas. Tech.
ChEMBL_37807 (CHEMBL651182)
IC50
2.63±n/a nM
Citation
 Trapani, GFranco, MLatrofa, ARicciardi, LCarotti, ASerra, MSanna, EBiggio, GLiso, G Novel 2-phenylimidazo[1,2-a]pyridine derivatives as potent and selective ligands for peripheral benzodiazepine receptors: synthesis, binding affinity, and in vivo studies. J Med Chem 42:3934-41 (1999)  
Target
Name:
Translocator protein
Synonyms:
Benzodiazepine receptors; peripheral & central Mbr PBR Peripheral benzodiazepine receptor (PBR) TSPO_RAT | Tspo
Type:
Mitochondrion membrane protein
Mol. Mass.:
18945.84
Organism:
Rattus norvegicus (rat)
Description:
Competitive binding experiments were performed on rat kidney mitochondrial membranes.
Residue:
169
  
Inhibitor
Name:
BDBM50060095
Synonyms:
2-[6,8-Dichloro-2-(4-chloro-phenyl)-imidazo[1,2-a]pyridin-3-yl]-N,N-dipropyl-acetamide | CHEMBL432608
Type:
Small organic molecule
Emp. Form.:
C21H22Cl3N3O
Mol. Mass.:
438.778
SMILES:
CCCN(CCC)C(=O)Cc1c(nc2c(Cl)cc(Cl)cn12)-c1ccc(Cl)cc1
: