Target
Prostaglandin G/H synthase 2
Ligand
BDBM50049011
Substrate
Meas. Tech.
ChEMBL_157693 (CHEMBL763870)
IC50
1±n/a nM
Citation
 Chavatte, PYous, SMarot, CBaurin, NLesieur, D Three-dimensional quantitative structure-activity relationships of cyclo-oxygenase-2 (COX-2) inhibitors: a comparative molecular field analysis. J Med Chem 44:3223-30 (2001)  
Target
Name:
Prostaglandin G/H synthase 2
Synonyms:
COX2 Cyclooxygenase 2 (COX-2) Cyclooxygenase-2 (COX-2 AA) Cyclooxygenase-2 (COX-2) PGH2_HUMAN PHS II Prostaglandin E synthase/G/H synthase 2 Prostaglandin-endoperoxide synthase 2
Type:
Enzyme
Mol. Mass.:
69003.89
Organism:
Homo sapiens (Human)
Description:
Recombinant Cox-2 provided by Cayman (Cayman Chemical Co.,Ann Arbor, MI).
Residue:
604
  
Inhibitor
Name:
BDBM50049011
Synonyms:
4-[6-(3,4-Dichloro-phenyl)-spiro[2.4]hept-5-en-5-yl]-benzenesulfonamide | CHEMBL313387
Type:
Small organic molecule
Emp. Form.:
C19H17Cl2NO2S
Mol. Mass.:
394.315
SMILES:
NS(=O)(=O)c1ccc(cc1)C1=C(CC2(CC2)C1)c1ccc(Cl)c(Cl)c1
: