Target
Liver carboxylesterase
Ligand
BDBM50371971
Substrate
Meas. Tech.
ChEMBL_45462 (CHEMBL657984)
IC50
8.32±n/a nM
Citation
 Wheelock, CEColvin, MEUemura, IOlmstead, MMSanborn, JRNakagawa, YJones, ADHammock, BD Use of ab initio calculations to predict the biological potency of carboxylesterase inhibitors. J Med Chem 45:5576-93 (2002)  
Target
Name:
Liver carboxylesterase
Synonyms:
Carboxylesterase | EST1_PIG
Type:
PROTEIN
Mol. Mass.:
62009.98
Organism:
Sus scrofa
Description:
ChEMBL_427761
Residue:
566
  
Inhibitor
Name:
BDBM50371971
Synonyms:
CHEMBL440542
Type:
Small organic molecule
Emp. Form.:
C9H15F3OS
Mol. Mass.:
228.275
SMILES:
CCCCCCSCC(=O)C(F)(F)F
: