Target
Liver carboxylesterase
Ligand
BDBM50409657
Substrate
Meas. Tech.
ChEMBL_45462 (CHEMBL657984)
IC50
114.82±n/a nM
Citation
 Wheelock, CEColvin, MEUemura, IOlmstead, MMSanborn, JRNakagawa, YJones, ADHammock, BD Use of ab initio calculations to predict the biological potency of carboxylesterase inhibitors. J Med Chem 45:5576-93 (2002)  
Target
Name:
Liver carboxylesterase
Synonyms:
Carboxylesterase | EST1_PIG
Type:
PROTEIN
Mol. Mass.:
62009.98
Organism:
Sus scrofa
Description:
ChEMBL_427761
Residue:
566
  
Inhibitor
Name:
BDBM50409657
Synonyms:
CHEMBL153015
Type:
Small organic molecule
Emp. Form.:
C10H15F5O
Mol. Mass.:
246.2175
SMILES:
CCCCCCCC(F)(F)C(=O)C(F)(F)F
: