Target
Liver carboxylesterase
Ligand
BDBM50409672
Substrate
Meas. Tech.
ChEMBL_45462 (CHEMBL657984)
IC50
16.98±n/a nM
Citation
 Wheelock, CEColvin, MEUemura, IOlmstead, MMSanborn, JRNakagawa, YJones, ADHammock, BD Use of ab initio calculations to predict the biological potency of carboxylesterase inhibitors. J Med Chem 45:5576-93 (2002)  
Target
Name:
Liver carboxylesterase
Synonyms:
Carboxylesterase | EST1_PIG
Type:
PROTEIN
Mol. Mass.:
62009.98
Organism:
Sus scrofa
Description:
ChEMBL_427761
Residue:
566
  
Inhibitor
Name:
BDBM50409672
Synonyms:
CHEMBL153080
Type:
Small organic molecule
Emp. Form.:
C9H16F3NO
Mol. Mass.:
211.2246
SMILES:
CCCCCCNCC(=O)C(F)(F)F
: