Target
Liver carboxylesterase
Ligand
BDBM50409660
Substrate
Meas. Tech.
ChEMBL_45462 (CHEMBL657984)
IC50
10.47±n/a nM
Citation
 Wheelock, CEColvin, MEUemura, IOlmstead, MMSanborn, JRNakagawa, YJones, ADHammock, BD Use of ab initio calculations to predict the biological potency of carboxylesterase inhibitors. J Med Chem 45:5576-93 (2002)  
Target
Name:
Liver carboxylesterase
Synonyms:
Carboxylesterase | EST1_PIG
Type:
PROTEIN
Mol. Mass.:
62009.98
Organism:
Sus scrofa
Description:
ChEMBL_427761
Residue:
566
  
Inhibitor
Name:
BDBM50409660
Synonyms:
CHEMBL155513
Type:
Small organic molecule
Emp. Form.:
C9H15F3O3Se
Mol. Mass.:
307.17
SMILES:
CCCCCC[Se](=O)(=O)CC(=O)C(F)(F)F
: