Target
Potassium voltage-gated channel subfamily H member 2
Ligand
BDBM50409962
Substrate
Meas. Tech.
ChEMBL_307245 (CHEMBL829152)
IC50
151.36±n/a nM
Citation
 Tobita, MNishikawa, TNagashima, R A discriminant model constructed by the support vector machine method for HERG potassium channel inhibitors. Bioorg Med Chem Lett 15:2886-90 (2005)  
Target
Name:
Potassium voltage-gated channel subfamily H member 2
Synonyms:
1,3-beta-glucan synthase component GLS2 ERG Eag-related protein 1 Ether-a-go-go-related gene (HERG) Ether-a-go-go-related gene potassium channel 1 Ether-a-go-go-related gene potassium channel 1 (hERG1) Ether-a-go-go-related protein 1 H-ERG KCNH2 Potassium voltage-gated channel subfamily H member 2 (hERG) Voltage-gated potassium channel subunit Kv11.1 hERG Potassium Channel 1 | putative potassium channel subunit
Type:
Multi-pass membrane protein
Mol. Mass.:
126672.65
Organism:
Homo sapiens (Human)
Description:
Q12809
Residue:
1159
  
Inhibitor
Name:
BDBM50409962
Synonyms:
RISPERIDON
Type:
Small organic molecule
Emp. Form.:
C23H29FN4O2
Mol. Mass.:
412.5004
SMILES:
Cc1nc2CCCCn2c(=O)c1CCN1CCC(CC1)C1NOc2cc(F)ccc12
: