Target
Neuronal acetylcholine receptor subunit alpha-4/beta-2
Ligand
BDBM50161092
Substrate
Meas. Tech.
ChEMBL_310669 (CHEMBL838016)
EC50
>100±n/a nM
Citation
 Fitch, RWKaneko, YKlaperski, PDaly, JWSeitz, GGündisch, D Halogenated and isosteric cytisine derivatives with increased affinity and functional activity at nicotinic acetylcholine receptors. Bioorg Med Chem Lett 15:1221-4 (2005)  
Target
Name:
Neuronal acetylcholine receptor subunit alpha-4/beta-2
Synonyms:
Neuronal acetylcholine receptor Alpha-4/Beta-2 Neuronal acetylcholine receptor; alpha4/beta2 | nAChR subtypes alpha4 beta2
Type:
Protein
Mol. Mass.:
Description:
Components:
This complex has 2 components.
Component 1
Name:
Neuronal acetylcholine receptor subunit alpha-4
Synonyms:
ACHA4_HUMAN CHRNA4 protein Neuronal acetylcholine receptor protein alpha-4 subunit Nicotinic acetylcholine receptor alpha4/beta2/alpha5
Type:
Mol. Mass.:
69963.49
Organism:
Homo sapiens (Human)
Description:
NACHRA4
Residue:
627
  
Component 2
Name:
Neuronal acetylcholine receptor subunit beta-2
Synonyms:
ACHB2_HUMAN Neuronal acetylcholine receptor protein beta-2 subunit | Nicotinic acetylcholine receptor alpha3/beta2/alpha5
Type:
Protein
Mol. Mass.:
57020.50
Organism:
Homo sapiens (Human)
Description:
P17787
Residue:
502
  
Inhibitor
Name:
BDBM50161092
Synonyms:
9,11-Dichloro-1,2,3,4,5,6-hexahydro-1,5-methano-pyrido[1,2-a][1,5]diazocin-8-one | CHEMBL65324
Type:
Small organic molecule
Emp. Form.:
C11H12Cl2N2O
Mol. Mass.:
259.132
SMILES:
Clc1cc(Cl)c(=O)n2CC3CNCC(C3)c12
: