Target
Neuronal acetylcholine receptor subunit alpha-3/beta-4
Ligand
BDBM50161089
Substrate
Meas. Tech.
ChEMBL_310813 (CHEMBL825005)
EC50
>100±n/a nM
Citation
 Fitch, RWKaneko, YKlaperski, PDaly, JWSeitz, GGündisch, D Halogenated and isosteric cytisine derivatives with increased affinity and functional activity at nicotinic acetylcholine receptors. Bioorg Med Chem Lett 15:1221-4 (2005)  
Target
Name:
Neuronal acetylcholine receptor subunit alpha-3/beta-4
Synonyms:
Neuronal acetylcholine receptor Alpha-3/Beta-4 Neuronal acetylcholine receptor; alpha3/beta4 | nAChR subtypes alpha3 beta4
Type:
Protein
Mol. Mass.:
Description:
Components:
This complex has 2 components.
Component 1
Name:
Neuronal acetylcholine receptor subunit alpha-3
Synonyms:
ACHA3_RAT Chrna3
Type:
Enzyme
Mol. Mass.:
56995.52
Organism:
Rattus norvegicus (Rat)
Description:
P04757
Residue:
499
  
Component 2
Name:
Neuronal acetylcholine receptor subunit beta-4
Synonyms:
ACHB4_RAT Chrnb4 Neuronal acetylcholine receptor non-alpha-2 chain | Neuronal acetylcholine receptor protein beta-4 subunit
Type:
Enzyme
Mol. Mass.:
55863.89
Organism:
Rattus norvegicus (Rat)
Description:
P12392
Residue:
495
  
Inhibitor
Name:
BDBM50161089
Synonyms:
11-Chloro-1,2,3,4,5,6-hexahydro-1,5-methano-pyrido[1,2-a][1,5]diazocin-8-one | CHEMBL294311
Type:
Small organic molecule
Emp. Form.:
C11H13ClN2O
Mol. Mass.:
224.687
SMILES:
Clc1ccc(=O)n2CC3CNCC(C3)c12
: