Target
Sodium-dependent dopamine transporter
Ligand
BDBM50148736
Substrate
Meas. Tech.
ChEMBL_307366 (CHEMBL835264)
Ki
14.13±n/a nM
Citation
 Hansch, CVerma, RPKurup, AMekapati, SB The role of QSAR in dopamine interactions. Bioorg Med Chem Lett 15:2149-57 (2005)  
Target
Name:
Sodium-dependent dopamine transporter
Synonyms:
DA transporter DAT1 Dopamine transporter protein (DAT) SC6A3_HUMAN Sodium-dependent dopamine transporter Solute carrier family 6 member 3
Type:
Multi-pass membrane protein
Mol. Mass.:
68497.11
Organism:
Homo sapiens (Human)
Description:
Q01959
Residue:
620
  
Inhibitor
Name:
BDBM50148736
Synonyms:
CHEMBL112528 | N-(2-{3-[Bis-(4-fluoro-phenyl)-methoxy]-8-aza-bicyclo[3.2.1]oct-8-yl}-ethyl)-nicotinamide
Type:
Small organic molecule
Emp. Form.:
C28H29F2N3O2
Mol. Mass.:
477.5456
SMILES:
Fc1ccc(cc1)C(OC1CC2CCC(C1)N2CCNC(=O)c1cccnc1)c1ccc(F)cc1
: