Target
Adenosine receptor A2b
Ligand
BDBM50410679
Substrate
Meas. Tech.
ChEMBL_330270 (CHEMBL862098)
Ki
147.91±n/a nM
Citation
 Carotti, ACadavid, MICenteno, NBEsteve, CLoza, MIMartinez, ANieto, RRaviña, ESanz, FSegarra, VSotelo, EStefanachi, AVidal, B Design, synthesis, and structure-activity relationships of 1-,3-,8-, and 9-substituted-9-deazaxanthines at the human A2B adenosine receptor. J Med Chem 49:282-99 (2006)  
Target
Name:
Adenosine receptor A2b
Synonyms:
AA2BR_HUMAN ADORA2B Adenosine receptors A2b | Adenosine receptors; A2a & A2b
Type:
G Protein-Coupled Receptor (GPCR)
Mol. Mass.:
36341.22
Organism:
Homo sapiens (Human)
Description:
Residue:
332
  
Inhibitor
Name:
BDBM50410679
Synonyms:
CHEMBL199354
Type:
Small organic molecule
Emp. Form.:
C23H22N4O5
Mol. Mass.:
434.4446
SMILES:
COc1cc(ccc1OCC(=O)Nc1ccccc1)-c1cc2n(C)c(=O)n(C)c(=O)c2[nH]1
: