Target
Tryptase beta-2
Ligand
BDBM50411002
Substrate
Meas. Tech.
ChEMBL_370996 (CHEMBL868494)
Ki
3.75±n/a nM
Citation
 Palmer, JTRydzewski, RMMendonca, RVSperandio, DSpencer, JRHirschbein, BLLohman, JBeltman, JNguyen, MLiu, L Design and synthesis of selective keto-1,2,4-oxadiazole-based tryptase inhibitors. Bioorg Med Chem Lett 16:3434-9 (2006)  
Target
Name:
Tryptase beta-2
Synonyms:
TPS2 TRYB2_HUMAN Tryptase II Tryptase-2
Type:
PROTEIN
Mol. Mass.:
30518.79
Organism:
Homo sapiens (Human)
Description:
ChEMBL_210702
Residue:
275
  
Inhibitor
Name:
BDBM50411002
Synonyms:
CHEMBL556994
Type:
Small organic molecule
Emp. Form.:
C28H34Cl2N4O4
Mol. Mass.:
561.5
SMILES:
CC(C)(C)C(=O)N[C@@H](CCCCN)C(=O)c1noc(Cc2ccc(OCCc3ccc(Cl)c(Cl)c3)cc2)n1
: