Target
Mitochondrial succinate dehydrogenase subunit C/Succinate dehydrogenase [ubiquinone] iron-sulfur subunit, mitochondrial
Ligand
BDBM50411094
Substrate
Meas. Tech.
ChEMBL_376968 (CHEMBL870330)
IC50
>30000±n/a nM
Citation
 Bolgunas, SClark, DAHanna, WSMauvais, PAPember, SO Potent inhibitors of the Qi site of the mitochondrial respiration complex III. J Med Chem 49:4762-6 (2006)  
Target
Name:
Mitochondrial succinate dehydrogenase subunit C/Succinate dehydrogenase [ubiquinone] iron-sulfur subunit, mitochondrial
Synonyms:
Mitochondrial complex II; succinate dehydrogenase
Type:
Mol. Mass.:
Description:
ASSAY_ID of EBI is 376968
Components:
This complex has 2 components.
Component 1
Name:
Mitochondrial succinate dehydrogenase subunit C
Synonyms:
SdhC
Type:
PROTEIN
Mol. Mass.:
20225.88
Organism:
Septoria tritici
Description:
EBI_100772
Residue:
187
  
Component 2
Name:
Succinate dehydrogenase [ubiquinone] iron-sulfur subunit, mitochondrial
Synonyms:
Ip SDH2 | SDHB_ZYMTR
Type:
PROTEIN
Mol. Mass.:
33680.57
Organism:
Septoria tritici
Description:
ChEMBL_376968
Residue:
297
  
Inhibitor
Name:
BDBM50411094
Synonyms:
CHEMBL379116
Type:
Small organic molecule
Emp. Form.:
C21H17N3O3
Mol. Mass.:
359.378
SMILES:
Cc1ccc(Oc2ccc(NC(=O)c3ccc4c[nH]nc4c3O)cc2)cc1
: