Target
P2X purinoceptor 7
Ligand
BDBM50412160
Substrate
Meas. Tech.
ChEMBL_556618 (CHEMBL958117)
IC50
57.54±n/a nM
Citation
 Nelson, DWSarris, KKalvin, DMNamovic, MTGrayson, GDonnelly-Roberts, DLHarris, RHonore, PJarvis, MFFaltynek, CRCarroll, WA Structure-activity relationship studies on N'-aryl carbohydrazide P2X7 antagonists. J Med Chem 51:3030-4 (2008)  
Target
Name:
P2X purinoceptor 7
Synonyms:
ATP receptor P2RX7_HUMAN P2X purinoceptor 7 (P2X7) P2Z receptor | Purinergic receptor
Type:
Protein
Mol. Mass.:
68602.85
Organism:
Homo sapiens (Human)
Description:
Q99572
Residue:
595
  
Inhibitor
Name:
BDBM50412160
Synonyms:
CHEMBL496499
Type:
Small organic molecule
Emp. Form.:
C19H26N2O
Mol. Mass.:
298.4225
SMILES:
Cc1ccc(C)c(NNC(=O)C23CC4CC(CC(C4)C2)C3)c1
: