Target
P2X purinoceptor 7
Ligand
BDBM50412160
Substrate
Meas. Tech.
ChEMBL_556619 (CHEMBL958118)
IC50
134.9±n/a nM
Citation
 Nelson, DWSarris, KKalvin, DMNamovic, MTGrayson, GDonnelly-Roberts, DLHarris, RHonore, PJarvis, MFFaltynek, CRCarroll, WA Structure-activity relationship studies on N'-aryl carbohydrazide P2X7 antagonists. J Med Chem 51:3030-4 (2008)  
Target
Name:
P2X purinoceptor 7
Synonyms:
ATP receptor P2X purinoceptor 7 P2X purinoceptor 7 (P2X7) P2X7 rat P2rx7 | Purinergic receptor
Type:
Protein
Mol. Mass.:
68403.50
Organism:
Rattus norvegicus (Rat)
Description:
Q64663
Residue:
595
  
Inhibitor
Name:
BDBM50412160
Synonyms:
CHEMBL496499
Type:
Small organic molecule
Emp. Form.:
C19H26N2O
Mol. Mass.:
298.4225
SMILES:
Cc1ccc(C)c(NNC(=O)C23CC4CC(CC(C4)C2)C3)c1
: