Target
Potassium voltage-gated channel subfamily H member 2
Ligand
BDBM61402
Substrate
Meas. Tech.
ChEMBL_556369 (CHEMBL954102)
IC50
7762.47±n/a nM
Citation
 Jia, LSun, H Support vector machines classification of hERG liabilities based on atom types. Bioorg Med Chem 16:6252-60 (2008)  
Target
Name:
Potassium voltage-gated channel subfamily H member 2
Synonyms:
1,3-beta-glucan synthase component GLS2 ERG Eag-related protein 1 Ether-a-go-go-related gene (HERG) Ether-a-go-go-related gene potassium channel 1 Ether-a-go-go-related gene potassium channel 1 (hERG1) Ether-a-go-go-related protein 1 H-ERG KCNH2 Potassium voltage-gated channel subfamily H member 2 (hERG) Voltage-gated potassium channel subunit Kv11.1 hERG Potassium Channel 1 | putative potassium channel subunit
Type:
Multi-pass membrane protein
Mol. Mass.:
126672.65
Organism:
Homo sapiens (Human)
Description:
Q12809
Residue:
1159
  
Inhibitor
Name:
BDBM61402
Synonyms:
(Z)-2-butenedioic acid;2-(2,2-dicyclohexylethyl)piperidine 2-(2,2-dicyclohexylethyl)piperidine;maleic acid CHEMBL75880 Perhexiline cid_5284439 | perhexiline maleate
Type:
Small organic molecule
Emp. Form.:
C19H35N
Mol. Mass.:
277.4879
SMILES:
C(C(C1CCCCC1)C1CCCCC1)C1CCCCN1
: