Target
Aldo-keto reductase family 1 member B1
Ligand
BDBM50025321
Substrate
Meas. Tech.
ChEMBL_490576 (CHEMBL981183)
IC50
169.82±n/a nM
Citation
 Mercader, AGDuchowicz, PRFernández, FMCastro, EABennardi, DOAutino, JCRomanelli, GP QSAR prediction of inhibition of aldose reductase for flavonoids. Bioorg Med Chem 16:7470-6 (2008)  
Target
Name:
Aldo-keto reductase family 1 member B1
Synonyms:
ALDR_RAT Akr1b4 Aldr1
Type:
PROTEIN
Mol. Mass.:
35797.87
Organism:
Rattus norvegicus
Description:
ChEMBL_1512484
Residue:
316
  
Inhibitor
Name:
BDBM50025321
Synonyms:
2-(3,4-Dihydroxy-phenyl)-5-hydroxy-6,7-dimethoxy-chromen-4-one 5,3',4'-Trihydroxy-6,7-dimethoxyflavone Cirsiliol
Type:
Small organic molecule
Emp. Form.:
C17H14O7
Mol. Mass.:
330.2889
SMILES:
COc1cc2oc(cc(=O)c2c(O)c1OC)-c1ccc(O)c(O)c1
: