Target
Sodium-dependent serotonin transporter
Ligand
BDBM50412443
Substrate
Meas. Tech.
ChEMBL_537449 (CHEMBL990614)
Ki
251.19±n/a nM
Citation
 Serafinowska, HTBlaney, FELovell, PJMerlo, GGScott, CMSmith, PWStarr, KRWatson, JM Novel 5-HT(1A/1B/1D) receptors antagonists with potent 5-HT reuptake inhibitory activity. Bioorg Med Chem Lett 18:5581-5 (2008)  
Target
Name:
Sodium-dependent serotonin transporter
Synonyms:
5-HT Transporter 5HT transporter Anandamid membrane transporter, AMT Monoamine transporters; Norepinephrine & serotonin Slc6a4 Sodium-dependent serotonin transporter (SERT) | imipramine receptor
Type:
Multi-pass membrane protein
Mol. Mass.:
70168.43
Organism:
Rattus norvegicus (rat)
Description:
P31652
Residue:
630
  
Inhibitor
Name:
BDBM50412443
Synonyms:
CHEMBL484386
Type:
Small organic molecule
Emp. Form.:
C27H31N3O3
Mol. Mass.:
445.5533
SMILES:
CC(CN1CCC(Cc2ccc3OCC(=O)Nc3c2)CC1)Oc1cccc2nc(C)ccc12
: