Target
Neuronal acetylcholine receptor subunit alpha-3
Ligand
BDBM50411213
Substrate
Meas. Tech.
ChEMBL_558728 (CHEMBL954130)
EC50
295.12±n/a nM
Citation
 Ye, MDawson, MI 3D-QSAR and QSSR studies of 3,8-diazabicyclo[4.2.0]octane derivatives as neuronal nicotinic acetylcholine receptors by comparative molecular field analysis (CoMFA). Bioorg Med Chem Lett 19:127-31 (2008)  
Target
Name:
Neuronal acetylcholine receptor subunit alpha-3
Synonyms:
ACHA3_HUMAN Cholinergic, Nicotinic Alpha3Beta2 Cholinergic, Nicotinic Alpha3Beta4x NACHRA3 Neuronal acetylcholine receptor subunit alpha-3 nicotinic central
Type:
Enzyme Catalytic Domain
Mol. Mass.:
57479.03
Organism:
Homo sapiens (Human)
Description:
Cholinergic, Nicotinic Alpha3Beta2 0 HUMAN::P32297
Residue:
505
  
Inhibitor
Name:
BDBM50411213
Synonyms:
CHEMBL468065
Type:
Small organic molecule
Emp. Form.:
C12H16ClN3
Mol. Mass.:
237.729
SMILES:
Cc1cc(cnc1Cl)N1C[C@H]2CCNC[C@@H]12
: