Target
Liver carboxylesterase 1
Ligand
BDBM22736
Substrate
Meas. Tech.
ChEMBL_560257 (CHEMBL1019596)
Ki
524.81±n/a nM
Citation
 Harada, TNakagawa, YWadkins, RMPotter, PMWheelock, CE Comparison of benzil and trifluoromethyl ketone (TFK)-mediated carboxylesterase inhibition using classical and 3D-quantitative structure-activity relationship analysis. Bioorg Med Chem 17:149-64 (2008)  
Target
Name:
Liver carboxylesterase 1
Synonyms:
Acyl coenzyme A:cholesterol acyltransferase CES1 EST1_HUMAN Serine hydrolase (CES1)
Type:
Protein
Mol. Mass.:
62520.83
Organism:
Homo sapiens (Human)
Description:
Residue:
567
  
Inhibitor
Name:
BDBM22736
Synonyms:
4-(2-oxo-2-phenylacetyl)benzoic acid | Benzil-based compound, 14
Type:
Small organic molecule
Emp. Form.:
C15H10O4
Mol. Mass.:
254.2375
SMILES:
OC(=O)c1ccc(cc1)C(=O)C(=O)c1ccccc1
: