Target
Alpha-1A adrenergic receptor
Ligand
BDBM50412779
Substrate
Meas. Tech.
ChEMBL_539780 (CHEMBL1034998)
Ki
158.49±n/a nM
Citation
 Quaglia, WPiergentili, ADel Bello, FFarande, YGiannella, MPigini, MRafaiani, GCarrieri, AAmantini, CLucciarini, RSantoni, GPoggesi, ELeonardi, A Structure-activity relationships in 1,4-benzodioxan-related compounds. 9. From 1,4-benzodioxane to 1,4-dioxane ring as a promising template of novel alpha1D-adrenoreceptor antagonists, 5-HT1A full agonists, and cytotoxic agents. J Med Chem 51:6359-70 (2008)  
Target
Name:
Alpha-1A adrenergic receptor
Synonyms:
ADA1A_HUMAN ADRA1C Alpha 1A-adrenoceptor Alpha adrenergic receptor 1a Alpha-adrenergic receptor 1c adrenergic Alpha1 | adrenergic Alpha1C
Type:
Cell-surface receptors
Mol. Mass.:
51511.67
Organism:
Homo sapiens (Human)
Description:
P35348
Residue:
466
  
Inhibitor
Name:
BDBM50412779
Synonyms:
CHEMBL494908
Type:
Small organic molecule
Emp. Form.:
C20H25NO4
Mol. Mass.:
343.4168
SMILES:
COc1ccccc1OCCNC[C@@H]1CO[C@H](CO1)c1ccccc1
: