Target
5-hydroxytryptamine receptor 2B
Ligand
BDBM50412989
Substrate
Meas. Tech.
ChEMBL_516614 (CHEMBL991390)
Ki
1698±n/a nM
Citation
 Wroblowski, BWigglesworth, MJSzekeres, PGSmith, GDRahman, SSNicholson, NHMuir, AIHall, AHeer, JPGarland, SLCoates, WJ The discovery of a selective, small molecule agonist for the MAS-related gene X1 receptor. J Med Chem 52:818-25 (2009)  
Target
Name:
5-hydroxytryptamine receptor 2B
Synonyms:
5-HT-2B 5-hydroxytryptamine (serotonin) receptor 2B [Homo sapiens] 5-hydroxytryptamine receptor 2C (5HT2C) HTR2B Serotonin 2b (5-HT2b) receptor | Serotonin Receptor 2B
Type:
G Protein-Coupled Receptor (GPCR)
Mol. Mass.:
54312.47
Organism:
Homo sapiens (Human)
Description:
Receptor binding assays were performed using human clone stably expressed in CHO cells.
Residue:
481
  
Inhibitor
Name:
BDBM50412989
Synonyms:
CHEMBL474473
Type:
Small organic molecule
Emp. Form.:
C29H29ClN6O3
Mol. Mass.:
545.032
SMILES:
COc1ccc(cn1)-c1ccc(cc1)C(=O)Nc1cccc(Cn2ncc(N3CCNCC3)c(Cl)c2=O)c1C
: