Target
5-hydroxytryptamine receptor 2A
Ligand
BDBM50412989
Substrate
Meas. Tech.
ChEMBL_516613 (CHEMBL991389)
Ki
2951±n/a nM
Citation
 Wroblowski, BWigglesworth, MJSzekeres, PGSmith, GDRahman, SSNicholson, NHMuir, AIHall, AHeer, JPGarland, SLCoates, WJ The discovery of a selective, small molecule agonist for the MAS-related gene X1 receptor. J Med Chem 52:818-25 (2009)  
Target
Name:
5-hydroxytryptamine receptor 2A
Synonyms:
5-HT-2 5-HT2A 5-hydroxytryptamine receptor 2A (5HT-2A) 5HT2A_HUMAN HTR2A | Serotonin receptor 2A
Type:
undefined
Mol. Mass.:
52607.65
Organism:
Homo sapiens (Human)
Description:
P28223
Residue:
471
  
Inhibitor
Name:
BDBM50412989
Synonyms:
CHEMBL474473
Type:
Small organic molecule
Emp. Form.:
C29H29ClN6O3
Mol. Mass.:
545.032
SMILES:
COc1ccc(cn1)-c1ccc(cc1)C(=O)Nc1cccc(Cn2ncc(N3CCNCC3)c(Cl)c2=O)c1C
: