Target
Neuronal acetylcholine receptor subunit alpha-4
Ligand
BDBM50187455
Substrate
Meas. Tech.
ChEMBL_562743 (CHEMBL1022415)
EC50
109.65±n/a nM
Citation
 Tosco, PAhring, PKDyhring, TPeters, DHarpsøe, KLiljefors, TBalle, T Complementary three-dimensional quantitative structure-activity relationship modeling of binding affinity and functional potency: a study on alpha4beta2 nicotinic ligands. J Med Chem 52:2311-6 (2009)  
Target
Name:
Neuronal acetylcholine receptor subunit alpha-4
Synonyms:
ACHA4_HUMAN CHRNA4 protein Neuronal acetylcholine receptor protein alpha-4 subunit Nicotinic acetylcholine receptor alpha4/beta2/alpha5
Type:
Mol. Mass.:
69963.49
Organism:
Homo sapiens (Human)
Description:
NACHRA4
Residue:
627
  
Inhibitor
Name:
BDBM50187455
Synonyms:
1-(6-Bromo-5-vinylpyridin-3-yl)-[1,4]diazepane CHEMBL379501
Type:
Small organic molecule
Emp. Form.:
C12H16BrN3O
Mol. Mass.:
298.179
SMILES:
Brc1ncc(cc1OC=C)N1CCCNCC1
: