Target
C-X-C chemokine receptor type 3
Ligand
BDBM50413581
Substrate
Meas. Tech.
ChEMBL_497564 (CHEMBL998621)
Ki
1584.89±n/a nM
Citation
 Wijtmans, MVerzijl, Dvan Dam, CMBosch, LSmit, MJLeurs, Rde Esch, IJ Exploring a pocket for polycycloaliphatic groups in the CXCR3 receptor with the aid of a modular synthetic strategy. Bioorg Med Chem Lett 19:2252-7 (2009)  
Target
Name:
C-X-C chemokine receptor type 3
Synonyms:
AAO92295.1 C-X-C chemokine receptor type 3 (CXCR3) CXCR3 CXCR3_HUMAN chemokine (C-X-C motif) receptor 3
Type:
Enzyme Catalytic Domain
Mol. Mass.:
40665.65
Organism:
Homo sapiens (Human)
Description:
Residue:
368
  
Inhibitor
Name:
BDBM50413581
Synonyms:
CHEMBL472484
Type:
Small organic molecule
Emp. Form.:
C22H30ClFN2
Mol. Mass.:
376.938
SMILES:
Fc1cc(Cl)ccc1CN1CCCN(CC1)C1C2CC3CC(C2)CC1C3
: