Target
Proto-oncogene tyrosine-protein kinase Src
Ligand
BDBM50097958
Substrate
Meas. Tech.
ChEMBL_501027 (CHEMBL978937)
IC50
3.16±n/a nM
Citation
 Tintori, CMagnani, MSchenone, SBotta, M Docking, 3D-QSAR studies and in silico ADME prediction on c-Src tyrosine kinase inhibitors. Eur J Med Chem 44:990-1000 (2009)  
Target
Name:
Proto-oncogene tyrosine-protein kinase Src
Synonyms:
Calmodulin/Proto-oncogene tyrosine-protein kinase Src Proto-oncogene c-Src SRC SRC_HUMAN V-src sarcoma (Schmidt-Ruppin A-2) viral oncogene homolog (avian) p60-Src | pp60c-src
Type:
Protein
Mol. Mass.:
59838.60
Organism:
Homo sapiens (Human)
Description:
P12931
Residue:
536
  
Inhibitor
Name:
BDBM50097958
Synonyms:
2-(4-(4-amino-5-(3-hydroxyphenyl)-7H-pyrrolo[2,3-d]pyrimidin-7-yl)piperidin-1-yl)-N,N-dimethylacetamide CHEMBL169920
Type:
Small organic molecule
Emp. Form.:
C21H26N6O2
Mol. Mass.:
394.4701
SMILES:
CN(C)C(=O)CN1CCC(CC1)n1cc(-c2cccc(O)c2)c2c(N)ncnc12
: