Target
Serine/threonine-protein kinase Chk1
Ligand
BDBM14717
Substrate
Meas. Tech.
ChEMBL_570759 (CHEMBL1026934)
Ki
10±n/a nM
Citation
 Brown, SPMuchmore, SW Large-scale application of high-throughput molecular mechanics with Poisson-Boltzmann surface area for routine physics-based scoring of protein-ligand complexes. J Med Chem 52:3159-65 (2009)  
Target
Name:
Serine/threonine-protein kinase Chk1
Synonyms:
CHEK1 CHK1 checkpoint homolog Checkpoint kinase-1 (CHK1)
Type:
Enzyme Catalytic Domain
Mol. Mass.:
54443.02
Organism:
Homo sapiens (Human)
Description:
gi_166295192
Residue:
476
  
Inhibitor
Name:
BDBM14717
Synonyms:
1-(5-chloro 2,4-dimethoxyphenyl)-3-(5-cyanopyrazin-2-yl)urea Urea Compound 2
Type:
Small Organic Molecule
Emp. Form.:
C14H12ClN5O3
Mol. Mass.:
333.73
SMILES:
COc1cc(OC)c(NC(=O)Nc2cnc(cn2)C#N)cc1Cl
: