Target
Muscarinic acetylcholine receptor M2
Ligand
BDBM50415212
Substrate
Meas. Tech.
ChEMBL_605173 (CHEMBL1067395)
Ki
89125.09±n/a nM
Citation
 Piergentili, AQuaglia, WDel Bello, FGiannella, MPigini, MBarocelli, EBertoni, SMatucci, RNesi, MBruni, BDi Vaira, M Properly substituted 1,4-dioxane nucleus favours the selective M3 muscarinic receptor activation. Bioorg Med Chem 17:8174-85 (2009)  
Target
Name:
Muscarinic acetylcholine receptor M2
Synonyms:
ACM2_HUMAN Cholinergic, muscarinic M2 Muscarinic acetylcholine receptor M2 and M5 | RecName: Full=Muscarinic acetylcholine receptor M2
Type:
GPCR
Mol. Mass.:
51730.61
Organism:
Homo sapiens (Human)
Description:
P08172
Residue:
466
  
Inhibitor
Name:
BDBM50415212
Synonyms:
CHEMBL593864
Type:
Small organic molecule
Emp. Form.:
C10H22NO2
Mol. Mass.:
188.2866
SMILES:
C[C@@H]1OC[C@@H](C[N+](C)(C)C)O[C@@H]1C
: