Target
Mitogen-activated protein kinase 10
Ligand
BDBM50415607
Substrate
Meas. Tech.
ChEMBL_621741 (CHEMBL1108473)
IC50
>15848.93±n/a nM
Citation
 Christopher, JAAtkinson, FLBax, BDBrown, MJChampigny, ACChuang, TTJones, EJMosley, JEMusgrave, JR 1-Aryl-3,4-dihydroisoquinoline inhibitors of JNK3. Bioorg Med Chem Lett 19:2230-4 (2009)  
Target
Name:
Mitogen-activated protein kinase 10
Synonyms:
JNK3 MAP kinase p49 3F12 MK10_HUMAN Mitogen-activated protein kinase 10 (Stress-activated protein kinase JNK3) (c-Jun N-terminal kinase 3) (MAP kinase p49 3F12) PRKM10 Stress-activated protein kinase JNK3 | c-Jun N-terminal kinase 3 (JNK3)
Type:
Enzyme
Mol. Mass.:
52586.89
Organism:
Homo sapiens (Human)
Description:
Residue:
464
  
Inhibitor
Name:
BDBM50415607
Synonyms:
CHEMBL1082865
Type:
Small organic molecule
Emp. Form.:
C16H13ClFNO
Mol. Mass.:
289.732
SMILES:
COc1cc2C(=NCCc2cc1Cl)c1cccc(F)c1
: