Target
Alpha-1D adrenergic receptor
Ligand
BDBM50415774
Substrate
Meas. Tech.
ChEMBL_615925 (CHEMBL1099771)
Ki
331.13±n/a nM
Citation
 Franchini, SPrandi, ASorbi, CTait, ABaraldi, AAngeli, PBuccioni, MCilia, APoggesi, EFossa, PBrasili, L Discovery of a new series of 5-HT1A receptor agonists. Bioorg Med Chem Lett 20:2017-20 (2010)  
Target
Name:
Alpha-1D adrenergic receptor
Synonyms:
ADA1D_HUMAN ADRA1D Adrenergic receptor alpha Alpha 1D-adrenoreceptor Alpha-1D adrenoceptor adrenergic Alpha1D
Type:
Enzyme Catalytic Domain
Mol. Mass.:
60485.82
Organism:
Homo sapiens (Human)
Description:
adrenergic Alpha1D ADRA1D HUMAN::P25100
Residue:
572
  
Inhibitor
Name:
BDBM50415774
Synonyms:
CHEMBL1078772
Type:
Small organic molecule
Emp. Form.:
C30H29NO3
Mol. Mass.:
451.5562
SMILES:
C(COc1ccccc1-c1ccccc1)NCC1COC(O1)(c1ccccc1)c1ccccc1
: