Target
Histamine H4 receptor
Ligand
BDBM50415917
Substrate
Meas. Tech.
ChEMBL_629751 (CHEMBL1121263)
EC50
2.63±n/a nM
Citation
 Ghorai, PKraus, ABirnkammer, TGeyer, RBernhardt, GDove, SSeifert, RElz, SBuschauer, A Chiral NG-acylated hetarylpropylguanidine-type histamine H2 receptor agonists do not show significant stereoselectivity. Bioorg Med Chem Lett 20:3173-6 (2010)  
Target
Name:
Histamine H4 receptor
Synonyms:
AXOR35 GPCR105 HH4R HRH4 Histamine H4 receptor Histamine receptor (H3 and H4) SP9144
Type:
G Protein-Coupled Receptor (GPCR)
Mol. Mass.:
44517.02
Organism:
Homo sapiens (Human)
Description:
Binding assays were using CHO cells stably expressing hH4R receptors.
Residue:
390
  
Inhibitor
Name:
BDBM50415917
Synonyms:
CHEMBL1096429
Type:
Small organic molecule
Emp. Form.:
C17H23N5O
Mol. Mass.:
313.3974
SMILES:
C[C@@H](CC(=O)NC(N)=NCCCc1cnc[nH]1)c1ccccc1
: