Target
Cytochrome P450 2C9
Ligand
BDBM50416318
Substrate
Meas. Tech.
ChEMBL_639971 (CHEMBL1174131)
IC50
19952.62±n/a nM
Citation
 Gleeson, PBravi, GModi, SLowe, D ADMET rules of thumb II: A comparison of the effects of common substituents on a range of ADMET parameters. Bioorg Med Chem 17:5906-19 (2009)  
Target
Name:
Cytochrome P450 2C9
Synonyms:
(R)-limonene 6-monooxygenase CP2C9_HUMAN CYP2C9 Cytochrome P450 2C9 (CYP2C9 ) P-450MP P450 PB-1 | S-mephenytoin 4-hydroxylase
Type:
Enzyme
Mol. Mass.:
55636.33
Organism:
Homo sapiens (Human)
Description:
P11712
Residue:
490
  
Inhibitor
Name:
BDBM50416318
Synonyms:
CHEMBL1170480
Type:
Small organic molecule
Emp. Form.:
C36H32F5N5O2
Mol. Mass.:
661.6636
SMILES:
Fc1cccc(CCc2nc(=O)c3cccnc3n2CC(=O)N(Cc2ccc(cc2)-c2ccc(cc2)C(F)(F)F)C2CCNCC2)c1F
: