Target
Alpha-1D adrenergic receptor
Ligand
BDBM50416782
Substrate
Meas. Tech.
ChEMBL_658239 (CHEMBL1246631)
Ki
2.51±n/a nM
Citation
 Franchini, SPrandi, ABaraldi, ASorbi, CTait, ABuccioni, MMarucci, GCilia, APirona, LFossa, PCichero, EBrasili, L 1,3-Dioxolane-based ligands incorporating a lactam or imide moiety: structure-affinity/activity relationship at alpha1-adrenoceptor subtypes and at 5-HT1A receptors. Eur J Med Chem 45:3740-51 (2010)  
Target
Name:
Alpha-1D adrenergic receptor
Synonyms:
ADA1D_HUMAN ADRA1D Adrenergic receptor alpha Alpha 1D-adrenoreceptor Alpha-1D adrenoceptor adrenergic Alpha1D
Type:
Enzyme Catalytic Domain
Mol. Mass.:
60485.82
Organism:
Homo sapiens (Human)
Description:
adrenergic Alpha1D ADRA1D HUMAN::P25100
Residue:
572
  
Inhibitor
Name:
BDBM50416782
Synonyms:
CHEMBL1242633
Type:
Small organic molecule
Emp. Form.:
C28H37N3O4
Mol. Mass.:
479.6111
SMILES:
COc1ccccc1N1CCN(C[C@@H]2CO[C@](CN3CCCCCC3=O)(O2)c2ccccc2)CC1
: