Target
Alpha-1D adrenergic receptor
Ligand
BDBM50416776
Substrate
Meas. Tech.
ChEMBL_658239 (CHEMBL1246631)
Ki
1.38±n/a nM
Citation
 Franchini, SPrandi, ABaraldi, ASorbi, CTait, ABuccioni, MMarucci, GCilia, APirona, LFossa, PCichero, EBrasili, L 1,3-Dioxolane-based ligands incorporating a lactam or imide moiety: structure-affinity/activity relationship at alpha1-adrenoceptor subtypes and at 5-HT1A receptors. Eur J Med Chem 45:3740-51 (2010)  
Target
Name:
Alpha-1D adrenergic receptor
Synonyms:
ADA1D_HUMAN ADRA1D Adrenergic receptor alpha Alpha 1D-adrenoreceptor Alpha-1D adrenoceptor adrenergic Alpha1D
Type:
Enzyme Catalytic Domain
Mol. Mass.:
60485.82
Organism:
Homo sapiens (Human)
Description:
adrenergic Alpha1D ADRA1D HUMAN::P25100
Residue:
572
  
Inhibitor
Name:
BDBM50416776
Synonyms:
CHEMBL1241557
Type:
Small organic molecule
Emp. Form.:
C31H39N3O5
Mol. Mass.:
533.6585
SMILES:
COc1ccccc1N1CCN(C[C@@H]2CO[C@](CN3C(=O)CC4(CCCC4)CC3=O)(O2)c2ccccc2)CC1
: