Target
5-hydroxytryptamine receptor 1A
Ligand
BDBM50416776
Substrate
Meas. Tech.
ChEMBL_658240 (CHEMBL1246632)
Ki
1.26±n/a nM
Citation
 Franchini, SPrandi, ABaraldi, ASorbi, CTait, ABuccioni, MMarucci, GCilia, APirona, LFossa, PCichero, EBrasili, L 1,3-Dioxolane-based ligands incorporating a lactam or imide moiety: structure-affinity/activity relationship at alpha1-adrenoceptor subtypes and at 5-HT1A receptors. Eur J Med Chem 45:3740-51 (2010)  
Target
Name:
5-hydroxytryptamine receptor 1A
Synonyms:
5-HT-1A 5-hydroxytryptamine receptor 1A (5-HT-1A) ADRB2RL1 Dopamine D2 receptor and serotonin 1a receptor HTR1A | Serotonin receptor 1A
Type:
Mol. Mass.:
46122.49
Organism:
Homo sapiens (Human)
Description:
Residue:
422
  
Inhibitor
Name:
BDBM50416776
Synonyms:
CHEMBL1241557
Type:
Small organic molecule
Emp. Form.:
C31H39N3O5
Mol. Mass.:
533.6585
SMILES:
COc1ccccc1N1CCN(C[C@@H]2CO[C@](CN3C(=O)CC4(CCCC4)CC3=O)(O2)c2ccccc2)CC1
: