Target
Alpha-1A adrenergic receptor
Ligand
BDBM50416773
Substrate
Meas. Tech.
ChEMBL_658237 (CHEMBL1246629)
Ki
0.263±n/a nM
Citation
 Franchini, SPrandi, ABaraldi, ASorbi, CTait, ABuccioni, MMarucci, GCilia, APirona, LFossa, PCichero, EBrasili, L 1,3-Dioxolane-based ligands incorporating a lactam or imide moiety: structure-affinity/activity relationship at alpha1-adrenoceptor subtypes and at 5-HT1A receptors. Eur J Med Chem 45:3740-51 (2010)  
Target
Name:
Alpha-1A adrenergic receptor
Synonyms:
ADA1A_HUMAN ADRA1C Alpha 1A-adrenoceptor Alpha adrenergic receptor 1a Alpha-adrenergic receptor 1c adrenergic Alpha1 | adrenergic Alpha1C
Type:
Cell-surface receptors
Mol. Mass.:
51511.67
Organism:
Homo sapiens (Human)
Description:
P35348
Residue:
466
  
Inhibitor
Name:
BDBM50416773
Synonyms:
CHEMBL1242352
Type:
Small organic molecule
Emp. Form.:
C27H30N2O3
Mol. Mass.:
430.5387
SMILES:
COc1ccccc1N1CCN(CC2OCC(O2)(c2ccccc2)c2ccccc2)CC1
: