Target
Alpha-1B adrenergic receptor
Ligand
BDBM50416853
Substrate
Meas. Tech.
ChEMBL_663468 (CHEMBL1251067)
Ki
0.537±n/a nM
Citation
 Carrieri, APiergentili, ADel Bello, FGiannella, MPigini, MLeonardi, AFanelli, FQuaglia, W Structure-activity relationships in 1,4-benzodioxan-related compounds. 10. Novela1-adrenoreceptor antagonists related to openphendioxan: synthesis, biological evaluation, anda1d computational study. Bioorg Med Chem 18:7065-77 (2010)  
Target
Name:
Alpha-1B adrenergic receptor
Synonyms:
ADA1B_HUMAN Adrenergic alpha1B Adrenergic receptor alpha Alpha 1B-adrenoreceptor | Alpha-1B adrenergic receptor
Type:
Enzyme
Mol. Mass.:
56862.13
Organism:
Homo sapiens (Human)
Description:
P35368
Residue:
520
  
Inhibitor
Name:
BDBM50416853
Synonyms:
CHEMBL43116
Type:
Small organic molecule
Emp. Form.:
C25H29NO5
Mol. Mass.:
423.5015
SMILES:
COc1cccc(OC)c1OCCNCCOc1ccccc1OCc1ccccc1
: